Reaction Details
TargetEnteropeptidase
LigandBDBM158131
Substrate/Competitorn/a
Meas. Tech.Inhibitory Activity Assay
Ki 0.310±n/a nM
Citation Koshiba, TTokumasu, MIchimaru, TOhsumi, KNakagawa, TYamada, TMatsumoto, KSuzuki, T Heteroarylcarboxylic acid ester derivative US Patent US9655879 Publication Date 5/23/2017
 
Enteropeptidase
Name:Enteropeptidase
Type:Enzyme
Mol. Mass.:112901.62
Organism:Homo sapiens (Human)
Description:P98073
Residue:1019
BDBM158131
NameBDBM158131
Synonyms:US9024044, 59 US9655879, 59
TypeSmall organic molecule
Emp. Form.C25H22FN3O7S
Mol. Mass.527.521
SMILESCC(C)(Cc1ccc(s1)C(=O)Oc1ccc(cc1F)C(N)=N)C(=O)Nc1cc(cc(c1)C(O)=O)C(O)=O