Reaction Details
TargetSodium channel protein type 9 subunit alpha
LigandBDBM309347
Substrate/Competitorn/a
Meas. Tech.FLIPR Assay
IC50 86.0±20 nM
Citation Ni, CPark, MShao, BTafesse, LYao, JYoungman, MAZhou, X Substituted pyridines as sodium channel blockers US Patent US9656959 Publication Date 5/23/2017
 
Sodium channel protein type 9 subunit alpha
Name:Sodium channel protein type 9 subunit alpha
Type:Protein
Mol. Mass.:226375.97
Organism:Homo sapiens (Human)
Description:Q15858
Residue:1988
BDBM309347
NameBDBM309347
Synonyms:(S)-2-acetamido-N-(6-(4-(4-fluorophenoxy)phenyl)pyridin-2-yl)-3 -(1H-imidazol-4-yl)propanamide | US9656959, Example 32
TypeSmall organic molecule
Emp. Form.C25H22FN5O3
Mol. Mass.459.4723
SMILESCC(=O)N[C@@H](Cc1c[nH]cn1)C(=O)Nc1cccc(n1)-c1ccc(Oc2ccc(F)cc2)cc1