Reaction Details
TargetSodium channel protein type 9 subunit alpha
LigandBDBM309353
Substrate/Competitorn/a
Meas. Tech.Electrophysiology Assay
Ki 19.0±10 nM
Citation Ni, CPark, MShao, BTafesse, LYao, JYoungman, MAZhou, X Substituted pyridines as sodium channel blockers US Patent US9656959 Publication Date 5/23/2017
 
Sodium channel protein type 9 subunit alpha
Name:Sodium channel protein type 9 subunit alpha
Type:Protein
Mol. Mass.:226375.97
Organism:Homo sapiens (Human)
Description:Q15858
Residue:1988
BDBM309353
NameBDBM309353
Synonyms:(S)-N-(6-(4-(4-fluorophenoxy)phenyl)pyridin-2-yl)-3-(1H-imidazol-4-yl)-2-(methylsulfonamido)propanamide | US9656959, Example 38
TypeSmall organic molecule
Emp. Form.C24H22FN5O4S
Mol. Mass.495.526
SMILESCS(=O)(=O)N[C@@H](Cc1c[nH]cn1)C(=O)Nc1cccc(n1)-c1ccc(Oc2ccc(F)cc2)cc1