Reaction Details
TargetSodium channel protein type 9 subunit alpha
LigandBDBM309373
Substrate/Competitorn/a
Meas. Tech.FLIPR Assay
IC50 270±32 nM
Citation Ni, CPark, MShao, BTafesse, LYao, JYoungman, MAZhou, X Substituted pyridines as sodium channel blockers US Patent US9656959 Publication Date 5/23/2017
 
Sodium channel protein type 9 subunit alpha
Name:Sodium channel protein type 9 subunit alpha
Type:Protein
Mol. Mass.:226375.97
Organism:Homo sapiens (Human)
Description:Q15858
Residue:1988
BDBM309373
NameBDBM309373
Synonyms:(S)-2-Amino-N-{6-[4-(4-fluoro-phenoxy)-phenyl]-pridin-2-yl}-3-hydroxy-propionamide | US9656959, Example 70
TypeSmall organic molecule
Emp. Form.C20H18FN3O3
Mol. Mass.367.3736
SMILESN[C@@H](CO)C(=O)Nc1cccc(n1)-c1ccc(Oc2ccc(F)cc2)cc1