Reaction Details
TargetSodium channel protein type 9 subunit alpha
LigandBDBM185912
Substrate/Competitorn/a
Meas. Tech.Electrophysiology Assay
Ki 57.0±n/a nM
Citation Ni, CTafesse, LYao, JYoungman, MPark, MShao, B Pyrimidines as sodium channel blockers US Patent US9656968 Publication Date 5/23/2017
 
Sodium channel protein type 9 subunit alpha
Name:Sodium channel protein type 9 subunit alpha
Type:Protein
Mol. Mass.:226375.97
Organism:Homo sapiens (Human)
Description:Q15858
Residue:1988
BDBM185912
NameBDBM185912
Synonyms:US9163008, 1 | US9656968, Compound 1
TypeSmall organic molecule
Emp. Form.C20H18FN5O3
Mol. Mass.395.387
SMILESC[C@H](Nc1cc(nc(n1)-c1ccc(Oc2ccc(F)cc2)cc1)C(N)=O)C(N)=O