Reaction Details
TargetSodium channel protein type 9 subunit alpha
LigandBDBM185967
Substrate/Competitorn/a
Meas. Tech.Electrophysiology Assay
Ki 53.0±n/a nM
Citation Ni, CTafesse, LYao, JYoungman, MPark, MShao, B Pyrimidines as sodium channel blockers US Patent US9656968 Publication Date 5/23/2017
 
Sodium channel protein type 9 subunit alpha
Name:Sodium channel protein type 9 subunit alpha
Type:Protein
Mol. Mass.:226375.97
Organism:Homo sapiens (Human)
Description:Q15858
Residue:1988
BDBM185967
NameBDBM185967
Synonyms:US9163008, 56 | US9656968, Compound 56
TypeSmall organic molecule
Emp. Form.C20H17FN4O4
Mol. Mass.396.3718
SMILESC[C@H](Oc1cc(nc(n1)-c1ccc(Oc2ccc(F)cc2)cc1)C(N)=O)C(N)=O