Reaction Details
TargetGlutamate receptor ionotropic, kainate 1
LigandBDBM141501
Substrate/Competitorn/a
Meas. Tech.Radioligand Binding Assay
Ki 27.0±n/a nM
Citation Li, GZhou, HWeiss, JDoller, DBurns, JF Bicyclo[3.2.1]octyl amide derivatives and uses of same US Patent US9656975 Publication Date 5/23/2017
 
Glutamate receptor ionotropic, kainate 1
Name:Glutamate receptor ionotropic, kainate 1
Type:Enzyme Catalytic Domain
Mol. Mass.:103984.96
Organism:Homo sapiens (Human)
Description:P39086
Residue:918
BDBM141501
NameBDBM141501
Synonyms:US8921370, 2 | US9656975, 2
TypeSmall organic molecule
Emp. Form.C22H24ClN3O2
Mol. Mass.397.898
SMILESCc1cccc(n1)C(=O)NC12CCC(C1)(CCC2)NC(=O)c1cccc(Cl)c1