Reaction Details
TargetLeukotriene C4 synthase
LigandBDBM223230
Substrate/Competitorn/a
Meas. Tech.In Vitro hLTC4 Synthase Enzyme Assay
IC50 38.0±n/a nM
Citation Ronn, RLindh, CJRingberg, EAndersson, HBNilsson, PSchaal, WRMunck af Rosenschöld, MNikitidis, ANikitidis, GJohannesson, PTyrchan, C Compounds and uses US Patent US9657001 Publication Date 5/23/2017
 
Leukotriene C4 synthase
Name:Leukotriene C4 synthase
Type:PROTEIN
Mol. Mass.:16575.59
Organism:Homo sapiens (Human)
Description:ChEMBL_961179
Residue:150
BDBM223230
NameBDBM223230
Synonyms:2-(5-((4-Chlorophenyl)((1-methylcyclopropyl)methyl)amino)-3-methoxypicolinoyl)cyclopropanecarboxylic acid US9657001, 5
TypeSmall Organic Molecule
Emp. Form.C22H23ClN2O4
Mol. Mass.414.882
SMILESCOc1cc(cnc1C(=O)C1CC1C(O)=O)N(CC1(C)CC1)c1ccc(Cl)cc1