Reaction Details
TargetLeukotriene C4 synthase
LigandBDBM223272
Substrate/Competitorn/a
Meas. Tech.In Vitro hLTC4 Synthase Enzyme Assay
IC50 61.0±n/a nM
Citation Ronn, RLindh, CJRingberg, EAndersson, HBNilsson, PSchaal, WRMunck af Rosenschöld, MNikitidis, ANikitidis, GJohannesson, PTyrchan, C Compounds and uses US Patent US9657001 Publication Date 5/23/2017
 
Leukotriene C4 synthase
Name:Leukotriene C4 synthase
Type:PROTEIN
Mol. Mass.:16575.59
Organism:Homo sapiens (Human)
Description:ChEMBL_961179
Residue:150
BDBM223272
NameBDBM223272
Synonyms:2-(4-((4-Chloronaphthalen-1-yl)(cyclopropylmethyl)amino)-2-methoxybenzoyl)cyclopropanecarboxylic acid US9657001, 47
TypeSmall Organic Molecule
Emp. Form.C26H24ClNO4
Mol. Mass.449.926
SMILESCOc1cc(ccc1C(=O)C1CC1C(O)=O)N(CC1CC1)c1ccc(Cl)c2ccccc12