Reaction Details
TargetLeukotriene C4 synthase
LigandBDBM223284
Substrate/Competitorn/a
Meas. Tech.In Vitro hLTC4 Synthase Enzyme Assay
IC50 18.0±n/a nM
Citation Ronn, RLindh, CJRingberg, EAndersson, HBNilsson, PSchaal, WRMunck af Rosenschöld, MNikitidis, ANikitidis, GJohannesson, PTyrchan, C Compounds and uses US Patent US9657001 Publication Date 5/23/2017
 
Leukotriene C4 synthase
Name:Leukotriene C4 synthase
Type:PROTEIN
Mol. Mass.:16575.59
Organism:Homo sapiens (Human)
Description:ChEMBL_961179
Residue:150
BDBM223284
NameBDBM223284
Synonyms:2-(5-((Cyclopropylmethyl)(4-methylnaphthalen-1-yl)amino)-4-methoxypyrimidine-2-carbonyl)cyclopropanecarboxylic acid US9657001, 59
TypeSmall Organic Molecule
Emp. Form.C25H25N3O4
Mol. Mass.431.4837
SMILESCOc1nc(ncc1N(CC1CC1)c1ccc(C)c2ccccc12)C(=O)C1CC1C(O)=O