Reaction Details
TargetLeukotriene C4 synthase
LigandBDBM223286
Substrate/Competitorn/a
Meas. Tech.In Vitro hLTC4 Synthase Enzyme Assay
IC50 39.0±n/a nM
Citation Ronn, RLindh, CJRingberg, EAndersson, HBNilsson, PSchaal, WRMunck af Rosenschöld, MNikitidis, ANikitidis, GJohannesson, PTyrchan, C Compounds and uses US Patent US9657001 Publication Date 5/23/2017
 
Leukotriene C4 synthase
Name:Leukotriene C4 synthase
Type:PROTEIN
Mol. Mass.:16575.59
Organism:Homo sapiens (Human)
Description:ChEMBL_961179
Residue:150
BDBM223286
NameBDBM223286
Synonyms:(2-(1H-Tetrazol-5-yl)cyclopropyl)(5-((cyclopropylmethyl)(4-fluoronaphthalen-1-yl)amino)-3-methoxypyridin-2-yl)methanone US9657001, 61
TypeSmall Organic Molecule
Emp. Form.C25H23FN6O2
Mol. Mass.458.4875
SMILESCOc1cc(cnc1C(=O)C1CC1c1nnn[nH]1)N(CC1CC1)c1ccc(F)c2ccccc12