Reaction Details
TargetNeutrophil elastase
LigandBDBM310019
Substrate/Competitorn/a
Meas. Tech.Neutrophil Elastase Assay
IC50<1.000±n/a nM
Citation Gnamm, CAnderskewitz, RHoesch, HMorschhaeuser, GOost, TPeters, SRies, UJ Substituted bicyclic dihydropyrimidinones and their use as inhibitors of neutrophil elastase activity US Patent US9657015 Publication Date 5/23/2017
 
Neutrophil elastase
Name:Neutrophil elastase
Type:Enzyme
Mol. Mass.:28532.38
Organism:Homo sapiens (Human)
Description:P08246
Residue:267
BDBM310019
NameBDBM310019
Synonyms:US9657015, Example 12 US9657015, Example 12.2 US9657015, Example 12.4 US9657015, Example 12.6 US9657015, Example 12.8 | US9657015, Example 12.9
TypeSmall organic molecule
Emp. Form.C24H20F3N5O3
Mol. Mass.483.4425
SMILESCNC(=O)CN1C(C2=C(CCNC2=O)N(C1=O)c1cccc(c1)C(F)(F)F)c1ccc(cc1)C#N