Reaction Details
TargetNeutrophil elastase
LigandBDBM310059
Substrate/Competitorn/a
Meas. Tech.Neutrophil Elastase Assay
IC50<1.000±n/a nM
Citation Gnamm, CAnderskewitz, RHoesch, HMorschhaeuser, GOost, TPeters, SRies, UJ Substituted bicyclic dihydropyrimidinones and their use as inhibitors of neutrophil elastase activity US Patent US9657015 Publication Date 5/23/2017
 
Neutrophil elastase
Name:Neutrophil elastase
Type:Enzyme
Mol. Mass.:28532.38
Organism:Homo sapiens (Human)
Description:P08246
Residue:267
BDBM310059
NameBDBM310059
Synonyms:US9657015, Example 22
TypeSmall organic molecule
Emp. Form.C22H16BrF3N4O2
Mol. Mass.505.287
SMILESCN1C(C2=C(CCNC2=O)N(C1=O)c1cccc(c1)C(F)(F)F)c1ccc(cc1Br)C#N