Reaction Details
TargetNeutrophil elastase
LigandBDBM310082
Substrate/Competitorn/a
Meas. Tech.Neutrophil Elastase Assay
IC50<1.000±n/a nM
Citation Gnamm, CAnderskewitz, RHoesch, HMorschhaeuser, GOost, TPeters, SRies, UJ Substituted bicyclic dihydropyrimidinones and their use as inhibitors of neutrophil elastase activity US Patent US9657015 Publication Date 5/23/2017
 
Neutrophil elastase
Name:Neutrophil elastase
Type:Enzyme
Mol. Mass.:28532.38
Organism:Homo sapiens (Human)
Description:P08246
Residue:267
BDBM310082
NameBDBM310082
Synonyms:US9657015, Example 39 US9657015, Example 39.2
TypeSmall organic molecule
Emp. Form.C24H20F3N5O3
Mol. Mass.483.4425
SMILESCN1CCC2=C(C(N(C)C(=O)N2c2cccc(c2)C(F)(F)F)c2ccc(cc2C(N)=O)C#N)C1=O