Reaction Details
TargetProteinase-activated receptor 4
LigandBDBM176036
Substrate/Competitorn/a
Meas. Tech.FLIPR Assay
Temperature298.15±n/a K
EC50 0.23±n/a nM
Commentsextracted
Citation Banville, JRémillard, RRuediger, EHDeon, DHGagnon, MDubé, LGuy, JPriestley, ESPosy, SLMaxwell, BDWong, PCLawrence, RMMiller, MM Imidazothiadiazole and imidazopyrazine derivatives as protease activated receptor 4 (PAR4) inhibitors for treating platelet aggregation US Patent US9688695 Publication Date 6/27/2017
 
Proteinase-activated receptor 4
Name:Proteinase-activated receptor 4
Type:Protein
Mol. Mass.:41145.16
Organism:Homo sapiens (Human)
Description:Q96RI0
Residue:385
BDBM176036
NameBDBM176036
Synonyms:US10047103, 69 | US9688695, 69
TypeSmall organic molecule
Emp. Form.C25H20N4O5S2
Mol. Mass.520.58
SMILESCOc1nn2cc(nc2s1)-c1cc2c(OCc3csc(n3)-c3ccc(CO)cc3)cc(OC)cc2o1