Reaction Details
TargetAcetylcholinesterase
LigandBDBM9006
Substrate/CompetitorBDBM8959
Meas. Tech.Cholinesterase Inhibition Assay
pH8±n/a
Temperature303.15±n/a K
IC50 4±0.2 nM
Citation Rodriguez-Franco, MIFernandez-Bachiller, MIPerez, CHernandez-Ledesma, BBartolome, B Novel tacrine-melatonin hybrids as dual-acting drugs for Alzheimer disease, with improved acetylcholinesterase inhibitory and antioxidant properties. J Med Chem49:459-62 (2006) 
 
Acetylcholinesterase
Name:Acetylcholinesterase
Type:Enzyme
Mol. Mass.:67659.62
Organism:Bos taurus (bovine)
Description:n/a
Residue:613
BDBM9006
BDBM8959
NameBDBM9006
Synonyms:6-(1,2,3,4-Tetrahydro-acridin-9-ylamino)-hexanoic acid [2-(1H-indol-3-yl)-ethyl]-amide Tacrine-Melatonin Hybrid 3a
TypeSmall organic molecule
Emp. Form.C29H34N4O
Mol. Mass.454.6065
SMILESO=C(CCCCCNc1c2CCCCc2nc2ccccc12)NCCc1c[nH]c2ccccc12