Reaction Details
TargetAcetylcholinesterase
LigandBDBM9012
Substrate/CompetitorBDBM8959
Meas. Tech.Cholinesterase Inhibition Assay
pH8±n/a
Temperature303.15±n/a K
IC50 2.0±0.1 nM
Citation Rodriguez-Franco, MIFernandez-Bachiller, MIPerez, CHernandez-Ledesma, BBartolome, B Novel tacrine-melatonin hybrids as dual-acting drugs for Alzheimer disease, with improved acetylcholinesterase inhibitory and antioxidant properties. J Med Chem49:459-62 (2006) 
 
Acetylcholinesterase
Name:Acetylcholinesterase
Type:Enzyme
Mol. Mass.:67659.62
Organism:Bos taurus (bovine)
Description:n/a
Residue:613
BDBM9012
BDBM8959
NameBDBM9012
Synonyms:7-(6,8-Dichloro-1,2,3,4-tetrahydro-acridin-9-ylamino)-heptanoic acid [2-(1H-indol-3-yl)-ethyl]-amide CHEMBL199585 | Tacrine-Melatonin Hybrid 6b
TypeSmall organic molecule
Emp. Form.C30H34Cl2N4O
Mol. Mass.537.523
SMILESClc1cc(Cl)c2c(NCCCCCCC(=O)NCCc3c[nH]c4ccccc34)c3CCCCc3nc2c1