Reaction Details
TargetAcetylcholinesterase
LigandBDBM9015
Substrate/CompetitorBDBM8959
Meas. Tech.Cholinesterase Inhibition Assay
pH8±n/a
Temperature303.15±n/a K
IC50 12±1 nM
Citation Rodriguez-Franco, MIFernandez-Bachiller, MIPerez, CHernandez-Ledesma, BBartolome, B Novel tacrine-melatonin hybrids as dual-acting drugs for Alzheimer disease, with improved acetylcholinesterase inhibitory and antioxidant properties. J Med Chem49:459-62 (2006) 
 
Acetylcholinesterase
Name:Acetylcholinesterase
Type:Enzyme
Mol. Mass.:67659.62
Organism:Bos taurus (bovine)
Description:n/a
Residue:613
BDBM9015
BDBM8959
NameBDBM9015
Synonyms:6-(6-Chloro-1,2,3,4-tetrahydro-acridin-9-ylamino)-hexanoic acid [2-(5-methoxy-1H-indol-3-yl)-ethyl]-amide Tacrine-Melatonin Hybrid 8a
TypeSmall organic molecule
Emp. Form.C30H35ClN4O2
Mol. Mass.519.078
SMILESCOc1ccc2[nH]cc(CCNC(=O)CCCCCNc3c4CCCCc4nc4cc(Cl)ccc34)c2c1