Reaction Details
TargetCarboxylic ester hydrolase
LigandBDBM9018
Substrate/CompetitorBDBM8978
Meas. Tech.Cholinesterase Inhibition Assay
IC50 3.5±n/a nM
Citation Rodriguez-Franco, MIFernandez-Bachiller, MIPerez, CHernandez-Ledesma, BBartolome, B Novel tacrine-melatonin hybrids as dual-acting drugs for Alzheimer disease, with improved acetylcholinesterase inhibitory and antioxidant properties. J Med Chem49:459-62 (2006) 
 
Carboxylic ester hydrolase
Name:Carboxylic ester hydrolase
Type:Protein
Mol. Mass.:68842.83
Organism:Equus caballus (Horse)
Description:Q9N1N9
Residue:602
BDBM9018
BDBM8978
NameBDBM9018
Synonyms:6-(1,2,3,4-Tetrahydro-acridin-9-ylamino)-hexanoic acid [2-(5-hydroxy-1H-indol-3-yl)-ethyl]-amide Tacrine-Melatonin Hybrid 11a
TypeSmall organic molecule
Emp. Form.C29H34N4O2
Mol. Mass.470.6059
SMILESOc1ccc2[nH]cc(CCNC(=O)CCCCCNc3c4CCCCc4nc4ccccc34)c2c1