Reaction Details
TargetAcetylcholinesterase
LigandBDBM9007
Substrate/CompetitorBDBM8959
Meas. Tech.Cholinesterase Inhibition Assay
IC50 0.5±n/a nM
Citation Rodriguez-Franco, MIFernandez-Bachiller, MIPerez, CHernandez-Ledesma, BBartolome, B Novel tacrine-melatonin hybrids as dual-acting drugs for Alzheimer disease, with improved acetylcholinesterase inhibitory and antioxidant properties. J Med Chem49:459-62 (2006) 
 
Acetylcholinesterase
Name:Acetylcholinesterase
Type:Enzyme
Mol. Mass.:67792.70
Organism:Homo sapiens (Human)
Description:P22303
Residue:614
BDBM9007
BDBM8959
NameBDBM9007
Synonyms:7-(1,2,3,4-Tetrahydro-acridin-9-ylamino)-heptanoic acid [2-(1H-indol-3-yl)-ethyl]-amide Tacrine-Melatonin Hybrid 3b
TypeSmall organic molecule
Emp. Form.C30H36N4O
Mol. Mass.468.633
SMILESO=C(CCCCCCNc1c2CCCCc2nc2ccccc12)NCCc1c[nH]c2ccccc12