Reaction Details
TargetCholinesterase
LigandBDBM9017
Substrate/CompetitorBDBM8978
Meas. Tech.Cholinesterase Inhibition Assay
IC50 25±n/a nM
Citation Rodriguez-Franco, MIFernandez-Bachiller, MIPerez, CHernandez-Ledesma, BBartolome, B Novel tacrine-melatonin hybrids as dual-acting drugs for Alzheimer disease, with improved acetylcholinesterase inhibitory and antioxidant properties. J Med Chem49:459-62 (2006) 
 
Cholinesterase
Name:Cholinesterase
Type:Homotetramer
Mol. Mass.:68422.27
Organism:Homo sapiens (Human)
Description:P06276
Residue:602
BDBM9017
BDBM8978
NameBDBM9017
Synonyms:7-(6,8-Dichloro-1,2,3,4-tetrahydro-acridin-9-ylamino)-heptanoic acid [2-(5-methoxy-1Hindol-3-yl)-ethyl]-amide Tacrine-Melatonin Hybrid 10b
TypeSmall organic molecule
Emp. Form.C31H36Cl2N4O2
Mol. Mass.567.549
SMILESCOc1ccc2[nH]cc(CCNC(=O)CCCCCCNc3c4CCCCc4nc4cc(Cl)cc(Cl)c34)c2c1