Reaction Details
TargetKetohexokinase
LigandBDBM319602
Substrate/Competitorn/a
Meas. Tech.KHK-C Assay B
IC50 2.40±n/a nM
Citation Dowling, MFernando, DFutatsugi, KHuard, KMagee, TVRaymer, BShavnya, ASmith, AThuma, BTsai, ATu, M Substituted 3-azabicyclo[3.1.0]hexanes as ketohexokinase inhibitors US Patent US11634410 Publication Date 4/25/2023
 
Ketohexokinase
Name:Ketohexokinase
Type:Enzyme Catalytic Domain
Mol. Mass.:32521.64
Organism:Homo sapiens (Human)
Description:n/a
Residue:298
BDBM319602
NameBDBM319602
Synonyms:US10174007, Example 42 US11634410, Example 42 | [(1R,5S,6R)-3-{5-methyl-2-[(2S)-2-methylazetidin-1-yl]-6-(trifluoromethyl)pyrimidin-4-yl}-3-azabicyclo[3.1.0]hex-6-yl]acetic acid
TypeSmall organic molecule
Emp. Form.C17H21F3N4O2
Mol. Mass.370.3694
SMILESC[C@H]1CCN1c1nc(N2C[C@H]3[C@H](CC(O)=O)[C@H]3C2)c(C)c(n1)C(F)(F)F