Reaction Details
TargetKetohexokinase
LigandBDBM601403
Substrate/Competitorn/a
Meas. Tech.KHK-C Assay A
IC50 4.40±n/a nM
Citation Dowling, MFernando, DFutatsugi, KHuard, KMagee, TVRaymer, BShavnya, ASmith, AThuma, BTsai, ATu, M Substituted 3-azabicyclo[3.1.0]hexanes as ketohexokinase inhibitors US Patent US11634410 Publication Date 4/25/2023
 
Ketohexokinase
Name:Ketohexokinase
Type:Enzyme Catalytic Domain
Mol. Mass.:32521.64
Organism:Homo sapiens (Human)
Description:n/a
Residue:298
BDBM601403
NameBDBM601403
Synonyms:US11634410, Example 50 | [(1R,5S,6R)-3-{5-cyano-4- [(2S,3R)-3-hydroxy-2- methylazetidin-1-yl]pyridin-2- yl}-3-azabicyclo[3.1.0]hex-6- yl]acetic acid
TypeSmall organic molecule
Emp. Form.C17H21F3N4O3
Mol. Mass.386.3688
SMILESC[C@H]1[C@H](O)CN1c1nc(N2C[C@H]3[C@H](CC(O)=O)[C@H]3C2)c(F)c(n1)C(C)(F)F