Reaction Details
TargetCholinesterase
LigandBDBM9078
Substrate/CompetitorBDBM8978
Meas. Tech.Cholinesterase Inhibition Assay
pH8±n/a
Temperature310.15±n/a K
IC50 500±70 nM
Citation Rampa, ABisi, ABelluti, FGobbi, SValenti, PAndrisano, VCavrini, VCavalli, ARecanatini, M Acetylcholinesterase inhibitors for potential use in Alzheimer's disease: molecular modeling, synthesis and kinetic evaluation of 11H-indeno-[1,2-b]-quinolin-10-ylamine derivatives. Bioorg Med Chem8:497-506 (2000) 
 
Cholinesterase
Name:Cholinesterase
Type:Homotetramer
Mol. Mass.:68422.27
Organism:Homo sapiens (Human)
Description:P06276
Residue:602
BDBM9078
BDBM8978
NameBDBM9078
Synonyms:11H-indeno-[1,2-b]-quinolin-10-ylamine deriv. 2n N-benzyl-10H-indeno[1,2-b]quinolin-11-amine
TypeSmall organic molecule
Emp. Form.C23H18N2
Mol. Mass.322.4024
SMILESC(Nc1c2Cc3ccccc3-c2nc2ccccc12)c1ccccc1