Reaction Details
TargetAcetylcholinesterase
LigandBDBM9074
Substrate/CompetitorBDBM8959
Meas. Tech.Cholinesterase Inhibition Assay
Ki 210±n/a nM
IC50 680±n/a nM
Citation Rampa, ABisi, ABelluti, FGobbi, SValenti, PAndrisano, VCavrini, VCavalli, ARecanatini, M Acetylcholinesterase inhibitors for potential use in Alzheimer's disease: molecular modeling, synthesis and kinetic evaluation of 11H-indeno-[1,2-b]-quinolin-10-ylamine derivatives. Bioorg Med Chem8:497-506 (2000) 
 
Acetylcholinesterase
Name:Acetylcholinesterase
Type:Enzyme
Mol. Mass.:67792.70
Organism:Homo sapiens (Human)
Description:P22303
Residue:614
BDBM9074
BDBM8959
NameBDBM9074
Synonyms:10H-indeno[1,2-b]quinolin-11-amine CHEMBL60167
TypeSmall organic molecule
Emp. Form.C16H12N2
Mol. Mass.232.2799
SMILESNc1c2Cc3ccccc3-c2nc2ccccc12