Reaction Details
TargetSodium/glucose cotransporter 1
LigandBDBM176727
Substrate/Competitorn/a
Meas. Tech.In Vitro Human SGLT1 Inhibition Assay
pH7.3±n/a
IC50 50±n/a nM
Commentsextracted
Citation Carson, KGGoodwin, NCHarrison, BARawlins, DBStrobel, EZambrowicz, B Inhibitors of sodium glucose cotransporter 1 US Patent US9688710 Publication Date 6/27/2017
 
Sodium/glucose cotransporter 1
Name:Sodium/glucose cotransporter 1
Type:Protein
Mol. Mass.:73503.78
Organism:Homo sapiens (Human)
Description:P13866
Residue:664
BDBM176727
NameBDBM176727
Synonyms:US9688710, 149 1-(1-hydroxy-2-methylpropan-2-yl)-3-(2-(4-(2-methyl-5-((3R,4R,5S,6R)-3,4,5-trihydroxy-6-(methylthio)tetrahydro-2H-pyran-2-yl)benzyl)phenoxy)ethyl)urea
TypeSmall organic molecule
Emp. Form.C27H38N2O7S
Mol. Mass.534.665
SMILESCS[C@H]1O[C@H]([C@H](O)[C@@H](O)[C@@H]1O)c1ccc(C)c(Cc2ccc(OCCNC(=O)NC(C)(C)CO)cc2)c1