Reaction Details
TargetD-amino-acid oxidase
LigandBDBM627549
Substrate/Competitorn/a
Meas. Tech.In Vitro Measurements of Human D-Amino Acid Oxidase (hDAAO) Activity Assay
IC50 2.50±n/a nM
Citation Tsai, GEMao, YLu, LChang, WHsieh, HHu, JWShih, THuang, C Compounds and pharmaceutical uses thereof US Patent US11793823 Publication Date 10/24/2023
 
D-amino-acid oxidase
Name:D-amino-acid oxidase
Type:Homodimer
Mol. Mass.:39476.06
Organism:Homo sapiens (Human)
Description:P14920
Residue:347
BDBM627549
NameBDBM627549
Synonyms:US11793823, Compound 121
TypeSmall organic molecule
Emp. Form.C117H74O69
Mol. Mass.2583.7981
SMILESOc1cc(cc(O)c1O)C(=O)Oc1cc(cc(O)c1O)C(=O)Oc1cc(cc(O)c1O)C(=O)Oc1cc(cc(O)c1O)C(=O)O[C@@H]1CO[C@H](OC(=O)c2cc(O)c(O)c(OC(=O)c3cc(O)c(O)c(OC(=O)c4cc(O)c(O)c(OC(=O)c5cc(O)c(O)c(O)c5)c4)c3)c2)[C@H](OC(=O)c2cc(O)c(O)c(OC(=O)c3cc(O)c(O)c(OC(=O)c4cc(O)c(O)c(OC(=O)c5cc(O)c(O)c(O)c5)c4)c3)c2)[C@H]1OC(=O)c1cc(O)c(O)c(OC(=O)c2cc(O)c(O)c(OC(=O)c3cc(O)c(O)c(OC(=O)c4cc(O)c(O)c(O)c4)c3)c2)c1