Reaction Details
TargetProto-oncogene tyrosine-protein kinase receptor Ret
LigandBDBM311752
Substrate/Competitorn/a
Meas. Tech.Measurement of Inhibitory Activity Against RET (In Vitro)
IC50 0.300±n/a nM
Citation Miyazaki, IShimamura, TKato, MFujita, HIguchi, S Fused pyrimidine compound or salt thereof US Patent US10155768 Publication Date 12/18/2018
 
Proto-oncogene tyrosine-protein kinase receptor Ret
Name:Proto-oncogene tyrosine-protein kinase receptor Ret
Type:Protein
Mol. Mass.:124318.29
Organism:Homo sapiens (Human)
Description:P07949
Residue:1114
BDBM311752
NameBDBM311752
Synonyms:Ex. Cpd. 206 US11046696, Compound 206
TypeSmall organic molecule
Emp. Form.C26H29FN6O3
Mol. Mass.492.5453
SMILESCOCc1ccc(NC(=O)c2c(C#CCN3CCOCC3)n(c3ncnc(N)c23)C2(C)CC2)cc1F