Reaction Details
TargetProto-oncogene tyrosine-protein kinase receptor Ret [V804M]
LigandBDBM311639
Substrate/Competitorn/a
Meas. Tech.Measurement of Inhibitory Activity Against RET (V804M)
IC50 1.000±n/a nM
Citation Miyazaki, IShimamura, TKato, MFujita, HIguchi, S Fused pyrimidine compound or salt thereof US Patent US10155768 Publication Date 12/18/2018
 
Proto-oncogene tyrosine-protein kinase receptor Ret [V804M]
Name:Proto-oncogene tyrosine-protein kinase receptor Ret [V804M]
Type:Enzyme Catalytic Domain
Mol. Mass.:124350.36
Organism:Homo sapiens (Human)
Description:P07949[V804M]
Residue:1114
BDBM311639
NameBDBM311639
Synonyms:Ex. Cpd. 91 US11046696, Compound 91
TypeSmall organic molecule
Emp. Form.C27H24N8O2
Mol. Mass.492.5319
SMILESCOCc1ccc(NC(=O)c2c(C#Cc3cnc4cccnn34)n(c3ncnc(N)c23)C2(C)CC2)cc1