Reaction Details
TargetProto-oncogene tyrosine-protein kinase receptor Ret [V804L]
LigandBDBM311676
Substrate/Competitorn/a
Meas. Tech.Inhibitory Activity Against Resistance Mutation of RET (In Vitro)
IC50 0.900±n/a nM
Citation Miyazaki, IShimamura, TKato, MFujita, HIguchi, S Fused pyrimidine compound or salt thereof US Patent US10155768 Publication Date 12/18/2018
 
Proto-oncogene tyrosine-protein kinase receptor Ret [V804L]
Name:Proto-oncogene tyrosine-protein kinase receptor Ret [V804L]
Type:Enzyme Catalytic Domain
Mol. Mass.:124332.32
Organism:Homo sapiens (Human)
Description:P07949[V804L]
Residue:1114
BDBM311676
NameBDBM311676
Synonyms:Ex. Cpd. 128 | US11046696, Compound 128
TypeSmall organic molecule
Emp. Form.C28H25N7O2
Mol. Mass.491.5438
SMILESCOCc1ccc(NC(=O)c2c(C#Cc3cnc4[nH]ccc4c3)n(c3ncnc(N)c23)C2(C)CC2)cc1