Reaction Details
TargetProto-oncogene tyrosine-protein kinase receptor Ret [V804L]
LigandBDBM311741
Substrate/Competitorn/a
Meas. Tech.Inhibitory Activity Against Resistance Mutation of RET (In Vitro)
IC50 0.600±n/a nM
Citation Miyazaki, IShimamura, TKato, MFujita, HIguchi, S Fused pyrimidine compound or salt thereof US Patent US10155768 Publication Date 12/18/2018
 
Proto-oncogene tyrosine-protein kinase receptor Ret [V804L]
Name:Proto-oncogene tyrosine-protein kinase receptor Ret [V804L]
Type:Enzyme Catalytic Domain
Mol. Mass.:124332.32
Organism:Homo sapiens (Human)
Description:P07949[V804L]
Residue:1114
BDBM311741
NameBDBM311741
Synonyms:Ex. Cpd. 193 US11046696, Compound 193
TypeSmall organic molecule
Emp. Form.C24H22N6O2S
Mol. Mass.458.535
SMILESCOCc1ccc(NC(=O)c2c(C#Cc3cncs3)n(c3ncnc(N)c23)C2(C)CC2)cc1