Reaction Details
TargetProthrombin
LigandBDBM50443853
Substrate/Competitorn/a
Meas. Tech.Enzymatic Activity Assay
IC50 0.190±n/a nM
Citation Beck, HMesch, SVakalopoulos, APfaff, NZimmermann, SFollmann, MKersten, ELevilain, GPartikel, KBroehl, APHeitmeier, SDietze-Torres, JLehmann, LGericke, KMSüßmeier, FBärfacker, LHillisch, ATersteegen, ABuchmüller, AGerdes, C SUBSTITUTED S-ALANINATE DERIVATIVES US Patent US20230391761 Publication Date 12/7/2023
 
Prothrombin
Name:Prothrombin
Type:Protein
Mol. Mass.:70029.57
Organism:Homo sapiens (Human)
Description:P00734
Residue:622
BDBM50443853
NameBDBM50443853
Synonyms:CHEMBL3091519 | US20230391761, Reference 1
TypeSmall organic molecule
Emp. Form.C24H30ClN5O5S2
Mol. Mass.568.109
SMILESCN1CCN(CC1)C(=O)[C@H](CNC(=O)c1ccc(Cl)s1)NS(=O)(=O)c1cccc(N2CCCC2=O)c1C