Reaction Details
TargetSomatostatin receptor type 4
LigandBDBM311946
Substrate/Competitorn/a
Meas. Tech.AMP Assay with Human Somatostatin 4 Receptor
EC50 0.600±n/a nM
Citation Giovannini, RCui, YDoods, HFerrara, MJust, SKuelzer, RLingard, IMazzaferro, RRudolf, K Somatostatin receptor subtype 4 (SSTR4) agonists US Patent US10166214 Publication Date 1/1/2019
 
Somatostatin receptor type 4
Name:Somatostatin receptor type 4
Type:Enzyme
Mol. Mass.:42015.38
Organism:Homo sapiens (Human)
Description:P31391
Residue:388
BDBM311946
NameBDBM311946
Synonyms:BDBM311964 US10675268, Example 100
TypeSmall organic molecule
Emp. Form.C18H23N3O
Mol. Mass.297.3947
SMILESCc1cc(c2ccccn12)C(C)(C)NC(=O)[C@@H]1[C@H]2CNC[C@@H]12