Reaction Details
TargetSomatostatin receptor type 4
LigandBDBM311974
Substrate/Competitorn/a
Meas. Tech.AMP Assay with Human Somatostatin 4 Receptor
EC50 0.700±n/a nM
Citation Giovannini, RCui, YDoods, HFerrara, MJust, SKuelzer, RLingard, IMazzaferro, RRudolf, K Somatostatin receptor subtype 4 (SSTR4) agonists US Patent US10166214 Publication Date 1/1/2019
 
Somatostatin receptor type 4
Name:Somatostatin receptor type 4
Type:Enzyme
Mol. Mass.:42015.38
Organism:Homo sapiens (Human)
Description:P31391
Residue:388
BDBM311974
NameBDBM311974
Synonyms:US10166214, Example 110 | US10675268, Example 110
TypeSmall organic molecule
Emp. Form.C17H19F3N4O
Mol. Mass.352.3542
SMILESCC(C)(NC(=O)[C@@H]1[C@H]2CNC[C@@H]12)c1n[nH]c2c(cccc12)C(F)(F)F