Reaction Details
TargetSomatostatin receptor type 4
LigandBDBM312040
Substrate/Competitorn/a
Meas. Tech.AMP Assay with Human Somatostatin 4 Receptor
EC50 1.20±n/a nM
Citation Giovannini, RCui, YDoods, HFerrara, MJust, SKuelzer, RLingard, IMazzaferro, RRudolf, K Somatostatin receptor subtype 4 (SSTR4) agonists US Patent US10166214 Publication Date 1/1/2019
 
Somatostatin receptor type 4
Name:Somatostatin receptor type 4
Type:Enzyme
Mol. Mass.:42015.38
Organism:Homo sapiens (Human)
Description:P31391
Residue:388
BDBM312040
NameBDBM312040
Synonyms:US10166214, Example 176 | US10675268, Example 176
TypeSmall organic molecule
Emp. Form.C17H26N4O
Mol. Mass.302.4145
SMILESCn1nc(c2CCCCc12)C(C)(C)NC(=O)[C@@H]1[C@H]2CNC[C@@H]12