Reaction Details
TargetSomatostatin receptor type 4
LigandBDBM311889
Substrate/Competitorn/a
Meas. Tech.Radiogland Binding Assays
Ki 114±n/a nM
Citation Giovannini, RCui, YDoods, HFerrara, MJust, SKuelzer, RLingard, IMazzaferro, RRudolf, K Somatostatin receptor subtype 4 (SSTR4) agonists US Patent US10166214 Publication Date 1/1/2019
 
Somatostatin receptor type 4
Name:Somatostatin receptor type 4
Type:Enzyme
Mol. Mass.:42015.38
Organism:Homo sapiens (Human)
Description:P31391
Residue:388
BDBM311889
NameBDBM311889
Synonyms:US10166214, Example 25 US9789082, Example 25
TypeSmall organic molecule
Emp. Form.C15H21N3O
Mol. Mass.259.3467
SMILESCc1cccnc1C(C)(C)NC(=O)[C@@H]1[C@H]2CNC[C@@H]12