Reaction Details
TargetSomatostatin receptor type 4
LigandBDBM311920
Substrate/Competitorn/a
Meas. Tech.Radiogland Binding Assays
Ki 100.0±n/a nM
Citation Giovannini, RCui, YDoods, HFerrara, MJust, SKuelzer, RLingard, IMazzaferro, RRudolf, K Somatostatin receptor subtype 4 (SSTR4) agonists US Patent US10166214 Publication Date 1/1/2019
 
Somatostatin receptor type 4
Name:Somatostatin receptor type 4
Type:Enzyme
Mol. Mass.:42015.38
Organism:Homo sapiens (Human)
Description:P31391
Residue:388
BDBM311920
NameBDBM311920
Synonyms:US10166214, Example 56 US9789082, Example 56
TypeSmall organic molecule
Emp. Form.C19H23N3O2
Mol. Mass.325.4048
SMILESCC(C)(COc1nccc2ccccc12)NC(=O)[C@@H]1[C@H]2CNC[C@@H]12