Reaction Details
TargetCalcitonin gene-related peptide 1
LigandBDBM311913
Substrate/Competitorn/a
Meas. Tech.Radioligand Binding Assay
Ki 0.079±n/a nM
Citation Christopher, JACongreve, MSBucknell, SJDeflorian, FPickworth, MMason, JS CGRP receptor antagonists US Patent US10166226 Publication Date 1/1/2019
 
Calcitonin gene-related peptide 1
Name:Calcitonin gene-related peptide 1
Type:Enzyme
Mol. Mass.:13902.80
Organism:Homo sapiens (Human)
Description:P06881
Residue:128
BDBM311913
NameBDBM311913
Synonyms:N-[(2R)-1-[4-(4-methyl-1H-imidazol-5-yl)-1,4'-bipiperidin-1'-yl]-3-(7-methyl-1H-indazol-5-yl)-1-oxopropan-2-yl]-4-(2-oxo-1,2-dihydroquinolin-3-yl)piperidine-1-carboxamide | US10166226, Example 2
TypeSmall organic molecule
Emp. Form.C40H49N9O3
Mol. Mass.703.8756
SMILESCc1nc[nH]c1C1CCN(CC1)C1CCN(CC1)C(=O)[C@@H](Cc1cc(C)c2[nH]ncc2c1)NC(=O)N1CCC(CC1)c1cc2ccccc2[nH]c1=O