Reaction Details
TargetBromodomain-containing protein 3 [51-123]
LigandBDBM179490
Substrate/Competitorn/a
Meas. Tech.FP Competitive Binding Assay (No.350)
Temperature298.15±n/a K
Ki 9.70±n/a nM
Commentsextracted
Citation Wang, SRan, XZhao, YYang, CLiu, LBai, LMcEachern, DStuckey, JMeagher, JLSun, DLi, XZhou, BKaratas, HLuo, RChinnaiyan, AAsangani, IA BET bromodomain inhibitors and therapeutic methods using the same US Patent US9675697 Publication Date 6/13/2017
 
Bromodomain-containing protein 3 [51-123]
Name:Bromodomain-containing protein 3 [51-123]
Type:n/a
Mol. Mass.:8887.10
Organism:Homo sapiens (Human)
Description:BD1 (51-123 aa) of Q15059
Residue:73
BDBM179490
NameBDBM179490
Synonyms:US9675697, Cpd. No. 196
TypeSmall organic molecule
Emp. Form.C34H34N6O3
Mol. Mass.574.6722
SMILESCOc1cc2c(cc1-c1c(C)noc1C)[nH]c1nc(C)nc(-c3ccc(C(=O)NC4CCN(C)CC4)c4ccccc34)c21