Reaction Details
TargetBromodomain-containing protein 3 [326-398]
LigandBDBM179491
Substrate/Competitorn/a
Meas. Tech.FP Competitive Binding Assay (No.350)
Temperature298.15±n/a K
Ki 1.30±n/a nM
Commentsextracted
Citation Wang, SRan, XZhao, YYang, CLiu, LBai, LMcEachern, DStuckey, JMeagher, JLSun, DLi, XZhou, BKaratas, HLuo, RChinnaiyan, AAsangani, IA BET bromodomain inhibitors and therapeutic methods using the same US Patent US9675697 Publication Date 6/13/2017
 
Bromodomain-containing protein 3 [326-398]
Name:Bromodomain-containing protein 3 [326-398]
Type:n/a
Mol. Mass.:8553.07
Organism:Homo sapiens (Human)
Description:BD2 (326-398 aa) of Q15059
Residue:73
BDBM179491
NameBDBM179491
Synonyms:US9675697, Cpd. No. 197
TypeSmall organic molecule
Emp. Form.C36H36N6O4
Mol. Mass.616.7088
SMILESCOc1cc2c(cc1-c1c(C)noc1C)[nH]c1nc(C)nc(-c3ccc(C(=O)NC4CCN(CC4)C4COC4)c4ccccc34)c21