Reaction Details
TargetBromodomain-containing protein 3 [51-123]
LigandBDBM179492
Substrate/Competitorn/a
Meas. Tech.FP Competitive Binding Assay (No.350)
Temperature298.15±n/a K
Ki 10.00±n/a nM
Commentsextracted
Citation Wang, SRan, XZhao, YYang, CLiu, LBai, LMcEachern, DStuckey, JMeagher, JLSun, DLi, XZhou, BKaratas, HLuo, RChinnaiyan, AAsangani, IA BET bromodomain inhibitors and therapeutic methods using the same US Patent US9675697 Publication Date 6/13/2017
 
Bromodomain-containing protein 3 [51-123]
Name:Bromodomain-containing protein 3 [51-123]
Type:n/a
Mol. Mass.:8887.10
Organism:Homo sapiens (Human)
Description:BD1 (51-123 aa) of Q15059
Residue:73
BDBM179492
NameBDBM179492
Synonyms:US9675697, Cpd. No. 207
TypeSmall organic molecule
Emp. Form.C33H32N6O3
Mol. Mass.560.6456
SMILESCOc1cc2c(cc1-c1c(C)noc1C)[nH]c1nc(C)nc(-c3ccc(C(=O)N4CCN(C)CC4)c4ccccc34)c21