Reaction Details
TargetSteroid hormone receptor ERR2
LigandBDBM310198
Substrate/Competitorn/a
Meas. Tech.Competitive Radioligand-Binding Assay
Ki 49.0±n/a nM
Citation Narayanan, RDalton, JTLevin, E Nuclear receptor binding agents US Patent US9604931 Publication Date 3/28/2017
 
Steroid hormone receptor ERR2
Name:Steroid hormone receptor ERR2
Type:PROTEIN
Mol. Mass.:48061.77
Organism:Homo sapiens (Human)
Description:ChEMBL_11254
Residue:433
BDBM310198
NameBDBM310198
Synonyms:4-bromo-6-hydroxy-2-(4-hydroxyphenyl)isoquinolin-1(2H)-one US9623021, Compound 12b
TypeSmall organic molecule
Emp. Form.C15H10BrNO3
Mol. Mass.332.149
SMILESOc1ccc(cc1)-n1cc(Br)c2cc(O)ccc2c1=O