Reaction Details
TargetSteroid hormone receptor ERR2
LigandBDBM312139
Substrate/Competitorn/a
Meas. Tech.Competitive Radioligand-Binding Assay
Ki 3.96±n/a nM
Citation Narayanan, RDalton, JTLevin, E Nuclear receptor binding agents US Patent US9604931 Publication Date 3/28/2017
 
Steroid hormone receptor ERR2
Name:Steroid hormone receptor ERR2
Type:PROTEIN
Mol. Mass.:48061.77
Organism:Homo sapiens (Human)
Description:ChEMBL_11254
Residue:433
BDBM312139
NameBDBM312139
Synonyms:2-(3-fluoro-4-hydroxyphenyl)-6,8-dihydroxy-4-vinylisoquinolin-1(2H)-one US9623021, Compound 15c
TypeSmall organic molecule
Emp. Form.C17H12FNO4
Mol. Mass.313.2799
SMILESOc1cc(O)c2c(c1)c(C=C)cn(-c1ccc(O)c(F)c1)c2=O