Reaction Details
TargetSteroid hormone receptor ERR2
LigandBDBM312140
Substrate/Competitorn/a
Meas. Tech.Competitive Radioligand-Binding Assay
Ki 0.480±n/a nM
Citation Narayanan, RDalton, JTLevin, E Nuclear receptor binding agents US Patent US9604931 Publication Date 3/28/2017
 
Steroid hormone receptor ERR2
Name:Steroid hormone receptor ERR2
Type:PROTEIN
Mol. Mass.:48061.77
Organism:Homo sapiens (Human)
Description:ChEMBL_11254
Residue:433
BDBM312140
NameBDBM312140
Synonyms:6,8-dihydroxy-2-(4-hydroxyphenyl)-4-(4-methoxyphenyl)isoquinolin-1(2H)-one US9604931, 15g | US9623021, Compound 15g
TypeSmall organic molecule
Emp. Form.C22H17NO5
Mol. Mass.375.3741
SMILESCOc1ccc(cc1)-c1cn(-c2ccc(O)cc2)c(=O)c2c(O)cc(O)cc12