Reaction Details
TargetProstaglandin E2 receptor EP2 subtype
LigandBDBM180008
Substrate/Competitorn/a
Meas. Tech.Binding Assay
pH6±n/a
Ki>10.00±n/a nM
Commentsextracted
Citation Shibakawa, NYoneda, KKatsube, TKanda, TIto, KYamamoto, KIwase, NUshiyama, S Substituted biaryl compound US Patent US9676720 Publication Date 6/13/2017
 
Prostaglandin E2 receptor EP2 subtype
Name:Prostaglandin E2 receptor EP2 subtype
Type:Enzyme
Mol. Mass.:39775.71
Organism:Homo sapiens (Human)
Description:P43116
Residue:358
BDBM180008
NameBDBM180008
Synonyms:US9676720, Comparative example 4
TypeSmall organic molecule
Emp. Form.C26H23ClN4O4S
Mol. Mass.523.003
SMILESOC(=O)CNc1cccc(CN(Cc2ccc(cc2)-c2ccc(Cl)cc2)S(=O)(=O)c2cccnc2)n1