Reaction Details
TargetNicotinamide phosphoribosyltransferase
LigandBDBM180921
Substrate/Competitorn/a
Meas. Tech.Biochemical Inhibition Assay
pH7.5±n/a
Temperature298.15±n/a K
IC50 1.00±n/a nM
Commentsextracted
Citation Bair, KWBuckmelter, AJHan, BLin, JReynolds, DJSmith, CCWang, ZZheng, X Compounds and compositions for the inhibition of NAMPT US Patent US9676721 Publication Date 6/13/2017
 
Nicotinamide phosphoribosyltransferase
Name:Nicotinamide phosphoribosyltransferase
Type:Enzyme
Mol. Mass.:55524.98
Organism:Homo sapiens (Human)
Description:P43490
Residue:491
BDBM180921
NameBDBM180921
Synonyms:US9676721, 79 2-cyano-1-{[4-(1-methyl-1H-indazole-6-sulfonyl)phenyl]methyl}-3-(pyridin-4-yl)guanidine
TypeSmall organic molecule
Emp. Form.C22H19N7O2S
Mol. Mass.445.497
SMILESCn1ncc2ccc(cc12)S(=O)(=O)c1ccc(CN\C(Nc2ccncc2)=N/C#N)cc1