Reaction Details
TargetBeta-secretase 1
LigandBDBM312938
Substrate/Competitorn/a
Meas. Tech.Cell-Free Assay
IC50 0.90±n/a nM
Citation Brodney, MABeck, EMButler, CRZhang, LO Neill, BTBarreiro, GLaChapelle, EARogers, BN 2-amino-6-methyl-4,4a,5,6-tetrahydropyrano[3,4-d][1,3]thiazin-8a(8H)-yl-1,3-thiazol-4-yl amides US Patent US9605007 Publication Date 3/28/2017
 
Beta-secretase 1
Name:Beta-secretase 1
Type:Protein
Mol. Mass.:55755.10
Organism:Homo sapiens (Human)
Description:P56817
Residue:501
BDBM312938
NameBDBM312938
Synonyms:N-{2-[(4aR,6S,8aR)-2-amino-6-methyl-4,4a,5,6-tetrahydropyrano[3,4-d][1,3]thiazin-8a(8H)-yl]-1,3-thiazol-4-yl}-1-(difluoromethyl)-1H-pyrazole-3-carboxamide | US9605007, Example 4
TypeSmall Organic Molecule
Emp. Form.C16H18F2N6O2S2
Mol. Mass.428.48
SMILESC[C@H]1C[C@H]2CSC(N)=N[C@]2(CO1)c1nc(NC(=O)c2ccn(n2)C(F)F)cs1