Reaction Details
TargetBeta-secretase 1
LigandBDBM223360
Substrate/Competitorn/a
Meas. Tech.Cell-Free Assay
IC50 101±n/a nM
Citation Brodney, MABeck, EMButler, CRZhang, LO Neill, BTBarreiro, GLaChapelle, EARogers, BN 2-amino-6-methyl-4,4a,5,6-tetrahydropyrano[3,4-d][1,3]thiazin-8a(8H)-yl-1,3-thiazol-4-yl amides US Patent US9605007 Publication Date 3/28/2017
 
Beta-secretase 1
Name:Beta-secretase 1
Type:Protein
Mol. Mass.:55755.10
Organism:Homo sapiens (Human)
Description:P56817
Residue:501
BDBM223360
NameBDBM223360
Synonyms:US9315520, 47 US9744173, Example 47
TypeSmall organic molecule
Emp. Form.C19H23N5O3S2
Mol. Mass.433.548
SMILESCOc1cnc(C(=O)Nc2csc(n2)[C@]23CO[C@@H](C)C[C@H]2CSC(N)=N3)c(C)c1