Reaction Details
TargetBeta-secretase 1
LigandBDBM223390
Substrate/Competitorn/a
Meas. Tech.Cell-Free Assay
IC50 85±n/a nM
Citation Brodney, MABeck, EMButler, CRZhang, LO Neill, BTBarreiro, GLaChapelle, EARogers, BN 2-amino-6-methyl-4,4a,5,6-tetrahydropyrano[3,4-d][1,3]thiazin-8a(8H)-yl-1,3-thiazol-4-yl amides US Patent US9605007 Publication Date 3/28/2017
 
Beta-secretase 1
Name:Beta-secretase 1
Type:Protein
Mol. Mass.:55755.10
Organism:Homo sapiens (Human)
Description:P56817
Residue:501
BDBM223390
NameBDBM223390
Synonyms:US9315520, 105 US9744173, Example 105
TypeSmall organic molecule
Emp. Form.C17H22N4O2S2
Mol. Mass.378.512
SMILESC[C@H]1C[C@H]2CSC(N)=N[C@]2(CO1)c1nc(NC(=O)C23CC(C2)C3)cs1