Reaction Details
TargetBaculoviral IAP repeat-containing protein 3/E3 ubiquitin-protein ligase XIAP
LigandBDBM312990
Substrate/Competitorn/a
Meas. Tech.Homogeneous Time Resolved Fluorescence (HTRF) Assay
IC50 2.00±n/a nM
Citation Borzilleri, RMZhang, YMiller, MFraley, A Macrocyclic compounds for inhibition of inhibitors of apoptosis US Patent US9605022 Publication Date 3/28/2017
 
Baculoviral IAP repeat-containing protein 3/E3 ubiquitin-protein ligase XIAP
Name:Baculoviral IAP repeat-containing protein 3/E3 ubiquitin-protein ligase XIAP
Type:Protein
Mol. Mass.:n/a
Description:n/a
Components:This complex has 2 components.
Component 1
Name:E3 ubiquitin-protein ligase XIAP
Synonyms:API3 E3 ubiquitin-protein ligase XIAP Inhibitor of apoptosis protein 3 X-linked inhibitor of apoptosis XIAP | XIAP_HUMAN
Type:Protein
Mol. Mass.:56685.27
Organism:Homo sapiens (Human)
Description:P98170
Residue:497
Component 2
Name:Baculoviral IAP repeat-containing protein 3
Synonyms:API2 BIRC3_HUMAN Baculoviral IAP repeat-containing protein 3 (IAP1 BIR3) MIHC XIAP-BIR3 | cIAP1/cIAP2
Type:Protein
Mol. Mass.:68365.75
Organism:Homo sapiens (Human)
Description:Q13489
Residue:604
BDBM312990
NameBDBM312990
Synonyms:US9605022, Example 19
TypeSmall organic molecule
Emp. Form.C81H96N18O14
Mol. Mass.1545.7411
SMILESCN[C@@H](C)C(=O)N[C@H](C(=O)N1CC[C@@H]2[C@H]1C(=O)N[C@@H](Cc1ccc3ccccc3c1)C(=O)N[C@H](Cc1ccc(OCc3cn(nn3)[C@@H]3CCN([C@@H]3C(=O)N[C@@H](Cc3ccc4ccccc4c3)C(=O)N[C@@H](Cc3ccc(OCc4cn2nn4)cc3)c2nc(=O)o[nH]2)C(=O)[C@@H](NC(=O)[C@H](C)NC)C(C)(C)C)cc1)C(O)=O)C(C)(C)C